interest-n
type: LexicalEntry
canonical form: interest
sense: 13307824-n
part of speech: noun

stake-n
type: LexicalEntry
canonical form: stake
sense: 13307824-n
part of speech: noun

13307824-n
type: LexicalConcept
in scheme: en-word.net
definition: (law) a right or legal share of something; a financial involvement with something
example: they have interests all over the world
example: a stake in the company's future
ili: i106493
lexfile: noun.possession
part of speech: noun
domain topic: 08458195-n
hypernym: 13306199-n