dower-n
type: LexicalEntry
canonical form: dower
sense: 13285102-n
part of speech: noun

13285102-n
type: LexicalConcept
in scheme: en-word.net
definition: a life estate to which a wife is entitled on the death of her husband
ili: i106358
lexfile: noun.possession
part of speech: noun
hypernym: 13272614-n