inheritance-n
type: LexicalEntry
canonical form: inheritance
sense: 13283812-n
part of speech: noun

heritage-n
type: LexicalEntry
canonical form: heritage
sense: 13283812-n
part of speech: noun

13283812-n
type: LexicalConcept
in scheme: en-word.net
definition: that which is inherited; a title or property or estate that passes by law to the heir on the death of the owner
ili: i106351
lexfile: noun.possession
part of speech: noun
domain topic: 08458195-n
hypernym: 13273872-n
mero part: 13285693-n