royalty-n
type: LexicalEntry
canonical form: royalty
sense: 13278881-n
part of speech: noun

13278881-n
type: LexicalConcept
in scheme: en-word.net
definition: payment to the holder of a patent or copyright or resource for the right to use their property
example: he received royalties on his book
ili: i106322
lexfile: noun.possession
part of speech: noun
hypernym: 13299398-n