estate-n
type: LexicalEntry
canonical form: estate
sense: 13271829-n
part of speech: noun

13271829-n
type: LexicalConcept
in scheme: en-word.net
definition: everything you own; all of your assets (whether real property or personal property) and liabilities
ili: i106282
lexfile: noun.possession
part of speech: noun
hypernym: 13265007-n