ownership-n
type: LexicalEntry
canonical form: ownership
sense: 13261412-n
part of speech: noun

13261412-n
type: LexicalConcept
in scheme: en-word.net
definition: the relation of an owner to the thing possessed; possession with the right to transfer possession to others
ili: i106221
lexfile: noun.possession
part of speech: noun
hypernym: 00032220-n