limb-n
type: LexicalEntry
canonical form: limb
sense: 13184701-n
part of speech: noun

tree branch-n
type: LexicalEntry
canonical form: tree branch
sense: 13184701-n
part of speech: noun

13184701-n
type: LexicalConcept
in scheme: en-word.net
definition: any of the main branches arising from the trunk or a bough of a tree
ili: i105844
lexfile: noun.plant
part of speech: noun
hypernym: 13184148-n