bark-n
type: LexicalEntry
canonical form: bark
sense: 13183195-n
part of speech: noun

13183195-n
type: LexicalConcept
in scheme: en-word.net
definition: tough protective covering of the woody stems and roots of trees and other woody plants
ili: i105836
lexfile: noun.plant
part of speech: noun
hypernym: 09280855-n