pod-n
type: LexicalEntry
canonical form: pod
sense: 13159832-n
part of speech: noun

seedpod-n
type: LexicalEntry
canonical form: seedpod
sense: 13159832-n
part of speech: noun

13159832-n
type: LexicalConcept
in scheme: en-word.net
definition: a several-seeded dehiscent fruit as e.g. of a leguminous plant
ili: i105692
lexfile: noun.plant
part of speech: noun
hypernym: 13155706-n