berry-n
type: LexicalEntry
canonical form: berry
sense: 13158186-n
part of speech: noun

13158186-n
type: LexicalConcept
in scheme: en-word.net
definition: a small fruit having any of various structures, e.g., simple (grape or blueberry) or aggregate (blackberry or raspberry)
ili: i105685
lexfile: noun.plant
part of speech: noun
hypernym: 13155706-n
mero part: 07758680-n