kernel-n
type: LexicalEntry
canonical form: kernel
sense: 13157787-n
part of speech: noun

meat-n
type: LexicalEntry
canonical form: meat
sense: 13157787-n
part of speech: noun

13157787-n
type: LexicalConcept
in scheme: en-word.net
definition: the inner and usually edible part of a seed or grain or nut or fruit stone
example: black walnut kernels are difficult to get out of the shell
ili: i105683
lexfile: noun.plant
part of speech: noun
hypernym: 13107668-n