ray-n
type: LexicalEntry
canonical form: ray
sense: 13152275-n
part of speech: noun

13152275-n
type: LexicalConcept
in scheme: en-word.net
definition: a branch of an umbel or an umbelliform inflorescence
ili: i105653
lexfile: noun.plant
part of speech: noun
hypernym: 13152915-n