crown-n
type: LexicalEntry
canonical form: crown
sense: 13148762-n
part of speech: noun

treetop-n
type: LexicalEntry
canonical form: treetop
sense: 13148762-n
part of speech: noun

13148762-n
type: LexicalConcept
in scheme: en-word.net
definition: the upper branches and leaves of a tree or other plant
ili: i105633
lexfile: noun.plant
part of speech: noun
hypernym: 08681598-n