root-n
type: LexicalEntry
canonical form: root
sense: 13145876-n
part of speech: noun

13145876-n
type: LexicalConcept
in scheme: en-word.net
definition: (botany) the usually underground organ that lacks buds or leaves or nodes; absorbs water and mineral salts; usually it anchors the plant to the ground
ili: i105618
lexfile: noun.plant
part of speech: noun
domain topic: 06076105-n
hypernym: 13108385-n
mero part: 13147187-n
mero part: 13147443-n
mero part: 13183195-n
mero substance: 13117076-n