gall-n
type: LexicalEntry
canonical form: gall
sense: 13120345-n
part of speech: noun

13120345-n
type: LexicalConcept
in scheme: en-word.net
definition: abnormal swelling of plant tissue caused by insects or microorganisms or injury
ili: i105555
lexfile: noun.plant
part of speech: noun
hypernym: 13116444-n