duct-n
type: LexicalEntry
canonical form: duct
sense: 13111816-n
part of speech: noun

13111816-n
type: LexicalConcept
in scheme: en-word.net
definition: a continuous tube formed by a row of elongated cells lacking intervening end walls
ili: i105504
lexfile: noun.plant
part of speech: noun
hypernym: 13107668-n