houseplant-n
type: LexicalEntry
canonical form: houseplant
sense: 13103783-n
part of speech: noun

13103783-n
type: LexicalConcept
in scheme: en-word.net
definition: any of a variety of plants grown indoors for decorative purposes
ili: i105467
lexfile: noun.plant
part of speech: noun
hypernym: 00017402-n