mushroom-n
type: LexicalEntry
canonical form: mushroom
sense: 13021801-n
part of speech: noun

13021801-n
type: LexicalConcept
in scheme: en-word.net
definition: common name for an edible agaric (contrasting with the inedible toadstool)
ili: i105063
lexfile: noun.plant
part of speech: noun
hypernym: 13019575-n