savory-n
type: LexicalEntry
canonical form: savory
sense: 12887728-n
part of speech: noun

12887728-n
type: LexicalConcept
in scheme: en-word.net
definition: any of several aromatic herbs or subshrubs of the genus Satureja having spikes of flowers attractive to bees
ili: i104413
lexfile: noun.plant
part of speech: noun
hypernym: 12226211-n