coffee-n
type: LexicalEntry
canonical form: coffee
sense: 12683533-n
part of speech: noun

coffee tree-n
type: LexicalEntry
canonical form: coffee tree
sense: 12683533-n
part of speech: noun

12683533-n
type: LexicalConcept
in scheme: en-word.net
definition: any of several small trees and shrubs native to the tropical Old World yielding coffee beans
ili: i103415
lexfile: noun.plant
part of speech: noun
hypernym: 13124818-n
mero part: 07945591-n