pondweed-n
type: LexicalEntry
canonical form: pondweed
sense: 12636471-n
part of speech: noun

12636471-n
type: LexicalConcept
in scheme: en-word.net
definition: any of several submerged or floating freshwater perennial aquatic weeds belonging to the family Potamogetonaceae
ili: i103184
lexfile: noun.plant
part of speech: noun
hypernym: 13142303-n