fritillary-n
type: LexicalEntry
canonical form: fritillary
sense: 12472420-n
part of speech: noun

checkered lily-n
type: LexicalEntry
canonical form: checkered lily
sense: 12472420-n
part of speech: noun

12472420-n
type: LexicalConcept
in scheme: en-word.net
definition: any liliaceous plant of the genus Fritillaria having nodding variously colored flowers
ili: i102410
lexfile: noun.plant
part of speech: noun
hypernym: 13155061-n