herb-n
type: LexicalEntry
canonical form: herb
sense: 12226211-n
part of speech: noun

herbaceous plant-n
type: LexicalEntry
canonical form: herbaceous plant
sense: 12226211-n
part of speech: noun

12226211-n
type: LexicalConcept
in scheme: en-word.net
definition: a plant lacking a permanent woody stem; many are flowering garden plants or potherbs; some having medicinal properties; some are pests
ili: i101265
lexfile: noun.plant
part of speech: noun
hypernym: 13104346-n
mero part: 07723196-n