rush-n
type: LexicalEntry
canonical form: rush
sense: 11763763-n
part of speech: noun

11763763-n
type: LexicalConcept
in scheme: en-word.net
definition: grasslike plants growing in wet places and having cylindrical often hollow stems
ili: i99044
lexfile: noun.plant
part of speech: noun
hypernym: 13143123-n