seed-n
type: LexicalEntry
canonical form: seed
sense: 11704458-n
part of speech: noun

11704458-n
type: LexicalConcept
in scheme: en-word.net
definition: a mature fertilized plant ovule consisting of an embryo and its food source and having a protective coat or testa
ili: i98741
lexfile: noun.plant
part of speech: noun
hypernym: 11699219-n
mero part: 11702818-n
mero part: 11702981-n
mero part: 11704733-n