annual-n
type: LexicalEntry
canonical form: annual
sense: 11573257-n
part of speech: noun

11573257-n
type: LexicalConcept
in scheme: en-word.net
definition: (botany) a plant that completes its entire life cycle within the space of a year
ili: i98301
lexfile: noun.plant
part of speech: noun
domain topic: 06076105-n
hypernym: 00017402-n