pulsation-n
type: LexicalEntry
canonical form: pulsation
sense: 11549746-n
part of speech: noun

11549746-n
type: LexicalConcept
in scheme: en-word.net
definition: a periodically recurring phenomenon that alternately increases and decreases some quantity
ili: i98189
lexfile: noun.phenomenon
part of speech: noun
hypernym: 00034512-n