draft-n
type: LexicalEntry
canonical form: draft
sense: 11542881-n
part of speech: noun

draught-n
type: LexicalEntry
canonical form: draught
sense: 11542881-n
part of speech: noun

11542881-n
type: LexicalConcept
in scheme: en-word.net
definition: a current of air (usually coming into a chimney or room or vehicle)
ili: i98156
lexfile: noun.phenomenon
part of speech: noun
hypernym: 11546388-n