reaction-n
type: LexicalEntry
canonical form: reaction
sense: 11518861-n
part of speech: noun

11518861-n
type: LexicalConcept
in scheme: en-word.net
definition: (mechanics) the equal and opposite force that is produced when any force is applied to a body
example: every action has an equal and opposite reaction
ili: i98019
lexfile: noun.phenomenon
part of speech: noun
domain topic: 06109843-n
hypernym: 11479041-n