halo-n
type: LexicalEntry
canonical form: halo
sense: 11507824-n
part of speech: noun

11507824-n
type: LexicalConcept
in scheme: en-word.net
definition: a circle of light around the sun or moon
ili: i97963
lexfile: noun.phenomenon
part of speech: noun
hypernym: 11445694-n