luminescence-n
type: LexicalEntry
canonical form: luminescence
sense: 11496830-n
part of speech: noun

11496830-n
type: LexicalConcept
in scheme: en-word.net
definition: light not due to incandescence; occurs at low temperatures
ili: i97901
lexfile: noun.phenomenon
part of speech: noun
hypernym: 11494354-n