haze-n
type: LexicalEntry
canonical form: haze
sense: 11486287-n
part of speech: noun

11486287-n
type: LexicalConcept
in scheme: en-word.net
definition: atmospheric moisture or dust or smoke that causes reduced visibility
ili: i97843
lexfile: noun.phenomenon
part of speech: noun
hypernym: 11442711-n