focus-n
type: LexicalEntry
canonical form: focus
sense: 11476112-n
part of speech: noun

focal point-n
type: LexicalEntry
canonical form: focal point
sense: 11476112-n
part of speech: noun

11476112-n
type: LexicalConcept
in scheme: en-word.net
definition: a point of convergence of light (or other radiation) or a point from which it diverges
ili: i97786
lexfile: noun.phenomenon
part of speech: noun
hypernym: 08637636-n