event-n
type: LexicalEntry
canonical form: event
sense: 11474277-n
part of speech: noun

11474277-n
type: LexicalConcept
in scheme: en-word.net
definition: a phenomenon located at a single point in space-time; the fundamental observational entity in relativity theory
ili: i97777
lexfile: noun.phenomenon
part of speech: noun
domain topic: 06116109-n
hypernym: 11439518-n