load-n
type: LexicalEntry
canonical form: load
sense: 11469898-n
part of speech: noun

11469898-n
type: LexicalConcept
in scheme: en-word.net
definition: the power output of a generator or power plant
ili: i97760
lexfile: noun.phenomenon
part of speech: noun
hypernym: 11469756-n