aureole-n
type: LexicalEntry
canonical form: aureole
sense: 11447181-n
part of speech: noun

corona-n
type: LexicalEntry
canonical form: corona
sense: 11447181-n
part of speech: noun

11447181-n
type: LexicalConcept
in scheme: en-word.net
definition: the outermost region of the sun's atmosphere; visible as a white halo during a solar eclipse
ili: i97633
lexfile: noun.phenomenon
part of speech: noun
hypernym: 11483770-n