harvest-n
type: LexicalEntry
canonical form: harvest
sense: 11434371-n
part of speech: noun

11434371-n
type: LexicalConcept
in scheme: en-word.net
definition: the consequence of an effort or activity
example: they gathered a harvest of examples
example: a harvest of love
ili: i97575
lexfile: noun.phenomenon
part of speech: noun
hypernym: 11430739-n