Xenophon-n
type: LexicalEntry
canonical form: Xenophon
sense: 11421278-n
part of speech: noun

11421278-n
type: LexicalConcept
in scheme: en-word.net
definition: Greek general and historian; student of Socrates (430-354 BC)
ili: i97506
lexfile: noun.person
part of speech: noun
instance hypernym: 10143381-n
instance hypernym: 10196781-n