Wise-n
type: LexicalEntry
canonical form: Wise
sense: 11413119-n
part of speech: noun

Isaac Mayer Wise-n
type: LexicalEntry
canonical form: Isaac Mayer Wise
sense: 11413119-n
part of speech: noun

11413119-n
type: LexicalConcept
in scheme: en-word.net
definition: United States religious leader (born in Bohemia) who united reform Jewish organizations in the United States (1819-1900)
ili: i97457
lexfile: noun.person
part of speech: noun
instance hypernym: 10539087-n