Solomon-n
type: LexicalEntry
canonical form: Solomon
sense: 11327754-n
part of speech: noun

11327754-n
type: LexicalConcept
in scheme: en-word.net
definition: (Old Testament) son of David and king of Israel noted for his wisdom (10th century BC)
ili: i96959
lexfile: noun.person
part of speech: noun
domain topic: 06461405-n
instance hypernym: 10251212-n