Rilke-n
type: LexicalEntry
canonical form: Rilke
sense: 11282564-n
part of speech: noun

Rainer Maria Rilke-n
type: LexicalEntry
canonical form: Rainer Maria Rilke
sense: 11282564-n
part of speech: noun

11282564-n
type: LexicalConcept
in scheme: en-word.net
definition: German poet (born in Austria) whose imagery and mystic lyricism influenced 20th-century German literature (1875-1926)
ili: i96712
lexfile: noun.person
part of speech: noun
instance hypernym: 10463768-n