Pauli-n
type: LexicalEntry
canonical form: Pauli
sense: 11246703-n
part of speech: noun

Wolfgang Pauli-n
type: LexicalEntry
canonical form: Wolfgang Pauli
sense: 11246703-n
part of speech: noun

11246703-n
type: LexicalConcept
in scheme: en-word.net
definition: United States physicist (born in Austria) who proposed the exclusion principle (thus providing a theoretical basis for the periodic table) (1900-1958)
ili: i96521
lexfile: noun.person
part of speech: noun
instance hypernym: 10384342-n