Pascal-n
type: LexicalEntry
canonical form: Pascal
sense: 11244409-n
part of speech: noun

Blaise Pascal-n
type: LexicalEntry
canonical form: Blaise Pascal
sense: 11244409-n
part of speech: noun

11244409-n
type: LexicalConcept
in scheme: en-word.net
definition: French mathematician and philosopher and Jansenist; invented an adding machine; contributed (with Fermat) to the theory of probability (1623-1662)
ili: i96511
lexfile: noun.person
part of speech: noun
instance hypernym: 10320928-n
instance hypernym: 10443334-n