Parks-n
type: LexicalEntry
canonical form: Parks
sense: 11243386-n
part of speech: noun

Rosa Parks-n
type: LexicalEntry
canonical form: Rosa Parks
sense: 11243386-n
part of speech: noun

11243386-n
type: LexicalConcept
in scheme: en-word.net
definition: United States civil rights leader who refused to give up her seat on a bus to a white man in Montgomery (Alabama) and so triggered the national Civil Rights movement (born in 1913)
ili: i96505
lexfile: noun.person
part of speech: noun
instance hypernym: 09944454-n