Nerva-n
type: LexicalEntry
canonical form: Nerva
sense: 11224059-n
part of speech: noun

Marcus Cocceius Nerva-n
type: LexicalEntry
canonical form: Marcus Cocceius Nerva
sense: 11224059-n
part of speech: noun

11224059-n
type: LexicalConcept
in scheme: en-word.net
definition: Emperor of Rome who introduced a degree of freedom after the repressive reign of Domitian; adopted Trajan as his successor (30-98)
ili: i96389
lexfile: noun.person
part of speech: noun
instance hypernym: 10556797-n