Navratilova-n
type: LexicalEntry
canonical form: Navratilova
sense: 11221730-n
part of speech: noun

Martina Navratilova-n
type: LexicalEntry
canonical form: Martina Navratilova
sense: 11221730-n
part of speech: noun

11221730-n
type: LexicalConcept
in scheme: en-word.net
definition: United States tennis player (born in Czechoslovakia) who won nine Wimbledon women's singles championships (born in 1956)
ili: i96376
lexfile: noun.person
part of speech: noun
instance hypernym: 10720829-n