Hutton-n
type: LexicalEntry
canonical form: Hutton
sense: 11089251-n
part of speech: noun

James Hutton-n
type: LexicalEntry
canonical form: James Hutton
sense: 11089251-n
part of speech: noun

11089251-n
type: LexicalConcept
in scheme: en-word.net
definition: Scottish geologist who described the processes that have shaped the surface of the earth (1726-1797)
ili: i95638
lexfile: noun.person
part of speech: noun
instance hypernym: 10147226-n