Gibran-n
type: LexicalEntry
canonical form: Gibran
sense: 11017993-n
part of speech: noun

Kahlil Gibran-n
type: LexicalEntry
canonical form: Kahlil Gibran
sense: 11017993-n
part of speech: noun

11017993-n
type: LexicalConcept
in scheme: en-word.net
definition: United States writer (born in Lebanon) (1883-1931)
ili: i95250
lexfile: noun.person
part of speech: noun
instance hypernym: 10813654-n