Galvani-n
type: LexicalEntry
canonical form: Galvani
sense: 11008883-n
part of speech: noun

Luigi Galvani-n
type: LexicalEntry
canonical form: Luigi Galvani
sense: 11008883-n
part of speech: noun

11008883-n
type: LexicalConcept
in scheme: en-word.net
definition: Italian physiologist noted for his discovery that frogs' muscles contracted in an electric field (which led to the galvanic cell) (1737-1798)
ili: i95202
lexfile: noun.person
part of speech: noun
instance hypernym: 10449729-n