Douglass-n
type: LexicalEntry
canonical form: Douglass
sense: 10961507-n
part of speech: noun

Frederick Douglass-n
type: LexicalEntry
canonical form: Frederick Douglass
sense: 10961507-n
part of speech: noun

10961507-n
type: LexicalConcept
in scheme: en-word.net
definition: United States abolitionist who escaped from slavery and became an influential writer and lecturer in the North (1817-1895)
ili: i94952
lexfile: noun.person
part of speech: noun
instance hypernym: 09775968-n